[ SlackList ] [ WkikiSlack ]




rekomilacja glibc

From: sir_skiner <s_malpka_o2.pl>
Date: Wed Feb 18 2004 - 17:45:48 CET

robie to za pomoca slackbuild. i jest problem:

#v+
bash-2.05b# make install install_root=$PKG
LANGUAGE=C LC_ALL=C; export LANGUAGE LC_ALL; \
make -r PARALLELMFLAGS="" CVSOPTS="" -C .. objdir=`pwd` install
make[1]: Entering directory `/tmp/glibc-2.3.2'
make -C csu subdir_lib
make[2]: Entering directory `/tmp/glibc-2.3.2/csu'
make[2]: Nothing to be done for `subdir_lib'.
make[2]: Leaving directory `/tmp/glibc-2.3.2/csu'
make -C iconv subdir_lib
make[2]: Entering directory `/tmp/glibc-2.3.2/iconv'
make[2]: Nothing to be done for `subdir_lib'.
make[2]: Leaving directory `/tmp/glibc-2.3.2/iconv'
make -C iconvdata subdir_lib
make[2]: Entering directory `/tmp/glibc-2.3.2/iconvdata'
make[2]: Nothing to be done for `subdir_lib'.
make[2]: Leaving directory `/tmp/glibc-2.3.2/iconvdata'
make -C locale subdir_lib
make[2]: Entering directory `/tmp/glibc-2.3.2/locale'
make[2]: Nothing to be done for `subdir_lib'.
make[2]: Leaving directory `/tmp/glibc-2.3.2/locale'
make -C localedata subdir_lib
make[2]: Entering directory `/tmp/glibc-2.3.2/localedata'
make[2]: Nothing to be done for `subdir_lib'.
make[2]: Leaving directory `/tmp/glibc-2.3.2/localedata'
make -C assert subdir_lib
make[2]: Entering directory `/tmp/glibc-2.3.2/assert'
make[2]: Nothing to be done for `subdir_lib'.
make[2]: Leaving directory `/tmp/glibc-2.3.2/assert'
make -C ctype subdir_lib
make[2]: Entering directory `/tmp/glibc-2.3.2/ctype'
make[2]: Nothing to be done for `subdir_lib'.
make[2]: Leaving directory `/tmp/glibc-2.3.2/ctype'
make -C intl subdir_lib
make[2]: Entering directory `/tmp/glibc-2.3.2/intl'
make[2]: Nothing to be done for `subdir_lib'.
make[2]: Leaving directory `/tmp/glibc-2.3.2/intl'
make -C catgets subdir_lib
make[2]: Entering directory `/tmp/glibc-2.3.2/catgets'
make[2]: Nothing to be done for `subdir_lib'.
make[2]: Leaving directory `/tmp/glibc-2.3.2/catgets'
make -C math subdir_lib
make[2]: Entering directory `/tmp/glibc-2.3.2/math'
make[2]: Nothing to be done for `subdir_lib'.
make[2]: Leaving directory `/tmp/glibc-2.3.2/math'
make -C setjmp subdir_lib
make[2]: Entering directory `/tmp/glibc-2.3.2/setjmp'
make[2]: Nothing to be done for `subdir_lib'.
make[2]: Leaving directory `/tmp/glibc-2.3.2/setjmp'
make -C signal subdir_lib
make[2]: Entering directory `/tmp/glibc-2.3.2/signal'
make[2]: Nothing to be done for `subdir_lib'.
make[2]: Leaving directory `/tmp/glibc-2.3.2/signal'
make -C stdlib subdir_lib
make[2]: Entering directory `/tmp/glibc-2.3.2/stdlib'
make[2]: Nothing to be done for `subdir_lib'.
make[2]: Leaving directory `/tmp/glibc-2.3.2/stdlib'
make -C stdio-common subdir_lib
make[2]: Entering directory `/tmp/glibc-2.3.2/stdio-common'
i486-slackware-linux-gcc sscanf.c -c -std=gnu99 -DG_DISABLE_ASERT -DNDEBUG -Os -Wall -Winline -Wstrict-prototypes -Wwrite-strings -g -m128bit-long-double -m3dnow -march=athlon-xp -mcpu=athlon-xp -mfpmath=sse,387 -mmmx -mpush-args -msse -pipe -s -I../include -I. -I/tmp/glibc-2.3.2/build-glibc-2.3.2/stdio-common -I.. -I../libio -I/tmp/glibc-2.3.2/build-glibc-2.3.2 -I../sysdeps/i386/elf -I../linuxthreads/sysdeps/unix/sysv/linux/i386 -I../linuxthreads/sysdeps/unix/sysv/linux -I../linuxthreads/sysdeps/pthread -I../sysdeps/pthread -I../linuxthreads/sysdeps/unix/sysv -I../linuxthreads/sysdeps/unix -I../linuxthreads/sysdeps/i386 -I../sysdeps/unix/sysv/linux/i386 -I../sysdeps/unix/sysv/linux -I../sysdeps/gnu -I../sysdeps/unix/common -I../sysdeps/unix/mman -I../sysdeps/unix/inet -I../sysdeps/unix/sysv/i386 -I../sysdeps/unix/sysv -I../sysdeps/unix/i386 -I../sysdeps/unix -I../sysdeps/posix -I../sysdeps/i386/i486 -I../sysdeps/i386/fpu -I../sysdeps/i386 -I../sysdeps/wordsize-32 -I../sysdeps/ieee754/ldbl-96 -I../sysd
eps/ieee754/dbl-64 -I../sysdeps/ieee754/flt-32 -I../sysdeps/ieee754 -I../sysdeps/generic/elf -I../sysdeps/generic -I /lib/modules/2.4.22-xfs/build/include -D_LIBC_REENTRANT -include ../include/libc-symbols.h -D_IO_MTSAFE_IO -o /tmp/glibc-2.3.2/build-glibc-2.3.2/stdio-common/sscanf.o
sscanf.c:31: warning: conflicting types for built-in function `sscanf'
sscanf.c: In function `sscanf':
sscanf.c:37: error: `va_start' used in function with fixed args
make[2]: *** [/tmp/glibc-2.3.2/build-glibc-2.3.2/stdio-common/sscanf.o] Error 1
make[2]: Leaving directory `/tmp/glibc-2.3.2/stdio-common'
make[1]: *** [stdio-common/subdir_lib] Error 2
make[1]: Leaving directory `/tmp/glibc-2.3.2'
make: *** [install] Błąd 2
#v-

co jest skopane?

--
\sir_skiner
|sebastian grzywacz
Linux - thinking better

Received on Sat Feb 21 18:42:45 2004

This archive was generated by hypermail 2.1.8. Wyprawa Shackleton 2014