[ SlackList ] [ WkikiSlack ]



Bład przy kompilacji modułow

From: czester11 <czester11@poczta.onet.pl>
Date: Tue Apr 22 2003 - 11:56:07 CEST
[slacklist] Bład przy kompilacji modułow

Witam

Przy kompilacji modułów
po komendzie
make modules
wysakauje cały czas taki komunikat

{standard input}: Assembler messages:
{standard input}:9: Warning: ignoring changed section = attributes for
.modinfo
cc -D__KERNEL__ -I/usr/src/linux-2.2.19/include -Wall = -Wstrict-prototypes -O
2 -fomit-frame-pointer -fno-strict-aliasing -D__SMP__ = -pipe -fno-strength-re
duce -m386 -DCPU=386 -DMODULE   -c -o =

A na samym koncu taki komunikat

cc: Internal compiler error: program cc1 got fatal = signal 4
make[3]: {standard input}: Assembler messages:
{standard input}:0: Warning: end of file not at end = of a line; newline
inserted
{standard input}:9: Warning: ignoring changed section = attributes for
.modinfo
{standard input}:255: Error: bad register name = `%'
cpp0: output pipe has been closed
*** [tdfx_drv.o] Bł?d 1
make[3]: Opuszczam katalog = `/usr/src/linux-2.4.20/drivers/char/drm'
make[2]: *** [_modsubdir_drm] Bł?d 2
make[2]: Opuszczam katalog = `/usr/src/linux-2.4.20/drivers/char'
make[1]: *** [_modsubdir_char] Bł?d 2
make[1]: Opuszczam katalog = `/usr/src/linux-2.4.20/drivers'
make: *** [_mod_drivers] Bł?d 2
root@serv:/usr/src/linux-2.4.20#

Co moge zrobic  by to naprawic mam slacka = 8.1




Received on Sat Feb 21 03:35:53 2004
This archive was generated by hypermail 2.1.8. Wyprawa Shackleton 2014